{"text_format":"1","workbook":"xlsx","n_sheets":7,"sheets":["表紙","基本情報・事業者情報の作成","届出書の作成","eAppData","ETL","LIST","【自動入力】様式第20"],"not_rendered":{"charts":0,"images":0,"macros":1,"external_links":0,"defined_names":23,"comments":0,"pivot_tables":0},"unopened":[],"bounds":{"document_bytes":16777216,"sheet_cells":100000,"rows_first":2000,"rows_last":500,"rows_between":2000,"halvings":0,"cell_chars":16384,"cell_head_chars":4096},"cells_cut":0,"cells_raw":0,"read":"whole","date_system":"1900"}

{"sheet":"表紙","index":0,"n_rows":42,"n_cols":27,"rows_kept":42,"cut":false,"hidden":false,"merged":[[38,3,38,17],[41,3,41,7],[33,2,33,26],[20,3,20,26],[21,3,21,11],[23,3,23,26],[29,3,29,26],[32,3,32,26],[28,11,28,17],[24,11,24,26],[26,3,26,26],[1,1,1,26],[4,1,4,26],[15,3,15,10],[18,3,18,10],[10,2,10,17],[9,1,9,26]]}
[null,"Version","2.0.1",null,null,null,null,null,null,null,null,null,null,null,null,null,null,null,null,null,null,null,null,null,null,null,"様式改訂：2024/06/27"]
[null,"化兵法に基づく第一種、第二種指定物質の輸出入実績届出（様式第２０）の作成"]
[]
[null,null,"基本情報・事業者情報の作成シートでは、化兵法に基づく届出書の基本情報と事業者情報を入力してください。"]
[null,"濃度しきい値を超えた指定物質を少量でも輸出入した場合、様式第２０による実績届出が必要です。"]
[null,"濃度しきい値："]
[null,null,"・第一種指定物質の毒性物質は１％超"]
[null,null,"・第一種指定物質の原料物質は３０％超"]
[null,null,"・第二種指定物質は３０％超"]
[null,"第一種指定物質、第二種指定物質に該当する物質については以下の経済産業省ホームページ５（２）の「第一種指定物質及び第二種指定物質」を参照して下さい。"]
{"$rows_left_out":33}
{"sheet":"基本情報・事業者情報の作成","index":1,"n_rows":113,"n_cols":24,"rows_kept":113,"cut":false,"hidden":false,"merged":[[108,1,112,5],[110,21,110,22],[111,21,111,22],[112,21,112,22],[108,6,108,20],[108,21,108,22],[46,21,46,22],[109,21,109,22],[69,3,76,10],[69,21,69,22],[70,21,70,22],[71,21,71,22],[72,21,72,22],[73,21,73,22],[74,21,74,22],[75,21,75,22],[76,21,76,22],[61,3,68,10],[61,21,61,22],[62,21,62,22],[63,21,63,22],[64,21,64,22],[65,21,65,22],[66,21,66,22],[67,21,67,22],[68,21,68,22],[47,21,47,22],[48,21,48,22],[49,21,49,22],[53,3,60,10],[53,21,53,22],[54,21,54,22],[55,21,55,22],[56,21,56,22],[57,21,57,22],[58,21,58,22],[59,21,59,22],[60,21,60,22],[26,2,26,21],[40,3,40,6],[40,8,40,9],[40,11,40,12],[43,3,43,6],[43,8,43,9],[43,11,43,12],[24,2,24,22],[1,1,1,23],[3,2,3,22],[6,3,6,6],[6,7,6,21],[7,7,7,21],[8,7,8,22],[9,3,9,6],[9,7,9,21],[10,7,10,22],[11,3,11,6],[11,7,11,21]]}
[null,null,null,null,null,null,null,null,null,null,null,null,null,null,null,null,null,null,null,null,null,null,null,"様式改訂：2024/06/27"]
[null,"化兵法に基づく届出書の基本情報・事業者情報"]
[]
[null,null,"基本情報・事業者情報の作成シートでは、化兵法に基づく届出書の基本情報と事業者情報を入力してください。"]
[]
[]
[null,null,null,"ピンク",null,null,null," の部分は、入力必須です。"]
[]
[]
[null,null,null,"ブルー",null,null,null," の部分は、設問項目に該当しない場合は、入力不要（空欄可）です。"]
{"$rows_left_out":104}
{"sheet":"届出書の作成","index":2,"n_rows":142,"n_cols":24,"rows_kept":142,"cut":false,"hidden":false,"merged":[[126,1,141,2],[127,8,127,20],[128,8,128,20],[129,8,129,20],[130,8,130,20],[131,3,131,20],[132,3,132,20],[133,3,133,20],[134,3,134,20],[135,3,141,13],[135,14,135,20],[136,14,136,20],[137,14,137,20],[138,14,138,20],[139,14,139,20],[140,14,140,20],[141,14,141,20],[109,1,124,2],[110,8,110,20],[111,8,111,20],[112,8,112,20],[113,8,113,20],[114,3,114,20],[115,3,115,20],[116,3,116,20],[117,3,117,20],[118,3,124,13],[118,14,118,20],[119,14,119,20],[120,14,120,20],[121,14,121,20],[122,14,122,20],[123,14,123,20],[124,14,124,20],[89,14,89,20],[90,14,90,20],[92,1,107,2],[93,8,93,20],[94,8,94,20],[95,8,95,20],[96,8,96,20],[97,3,97,20],[98,3,98,20],[99,3,99,20],[100,3,100,20],[101,3,107,13],[101,14,101,20],[102,14,102,20],[103,14,103,20],[104,14,104,20],[105,14,105,20],[106,14,106,20],[107,14,107,20],[73,14,73,20],[75,1,90,2],[76,8,76,20],[77,8,77,20],[78,8,78,20],[79,8,79,20],[80,3,80,20],[81,3,81,20],[82,3,82,20],[83,3,83,20],[84,3,90,13],[84,14,84,20],[85,14,85,20],[86,14,86,20],[87,14,87,20],[88,14,88,20],[58,1,73,2],[59,8,59,20],[60,8,60,20],[61,8,61,20],[62,8,62,20],[63,3,63,20],[64,3,64,20],[65,3,65,20],[47,3,47,20],[48,3,48,20],[49,3,49,20],[50,3,56,13],[50,14,50,20],[51,14,51,20],[52,14,52,20],[53,14,53,20],[54,14,54,20],[55,14,55,20],[56,14,56,20],[17,21,17,22],[1,1,1,23],[3,2,3,22],[6,3,6,6],[6,7,6,21],[7,7,7,21],[8,7,8,22],[9,3,9,6],[9,7,9,21],[10,7,10,22],[11,3,11,6],[11,7,11,21],[32,3,32,20],[22,3,22,5],[24,1,39,2],[25,8,25,20],[26,8,26,20],[27,8,27,20],[28,8,28,20],[29,3,29,20],[30,3,30,20],[31,3,31,20],[148,2,148,23],[149,2,149,23],[33,14,33,20],[35,14,35,20],[37,14,37,20],[39,14,39,20],[33,3,39,13],[38,14,38,20],[34,14,34,20],[36,14,36,20],[41,1,56,2],[42,8,42,20],[43,8,43,20],[44,8,44,20],[45,8,45,20],[46,3,46,20],[66,3,66,20],[67,3,73,13],[67,14,67,20],[68,14,68,20],[69,14,69,20],[70,14,70,20],[71,14,71,20],[72,14,72,20]]}
[null,null,null,null,null,null,null,null,null,null,null,null,null,null,null,null,null,null,null,null,null,null,null,"様式改訂：2024/06/27"]
[null,"化兵法に基づく第一種、第二種指定物質の輸出入実績届出（様式第２０）の作成"]
[]
[null,null,"基本情報・事業者情報の作成シートでは、化兵法に基づく届出書の基本情報と事業者情報を入力してください。"]
[]
[]
[null,null,null,"ピンク",null,null,null," の部分は、入力必須です。"]
[]
[]
[null,null,null,"ブルー",null,null,null," の部分は、設問項目に該当しない場合は、入力不要（空欄可）です。"]
{"$rows_left_out":133}
{"sheet":"eAppData","index":3,"n_rows":27,"n_cols":52,"rows_kept":27,"cut":false,"hidden":true,"merged":[]}
["事業所マスタ",1,null,null,null,null,"配布Version",2,"様式種別","20","←配布Version、様式種別はR5年改修時追加項目"]
["No","AM018_PlantSiteCode","AM018_PlantSiteName","AM018_ProvinceCode","AM018_Province","AM018_City","AM018_Address","AM018_Report_Post_1","AM018_Report_Address_1","AM018_Report_Department_1","AM018_Report_Position_1","AM018_Report_Person_1","AM018_Report_Tel_1","AM018_Report_Fax_1","AM018_Report_Email_1","AM018_Report_Post_2","AM018_Report_Address_2","AM018_Report_Department_2","AM018_Report_Position_2","AM018_Report_Person_2","AM018_Report_Tel_2","AM018_Report_Fax_2","AM018_Report_Email_2","AM018_Report_Post_3","AM018_Report_Address_3","AM018_Report_Department_3","AM018_Report_Position_3","AM018_Report_Person_3","AM018_Report_Tel_3","AM018_Report_Fax_3","AM018_Report_Email_3","AM018_Inspectiont_Address_1","AM018_Inspectiont_Department_1","AM018_Inspectiont_Position_1","AM018_Inspectiont_Person_1","AM018_Inspectiont_Tel_1","AM018_Inspectiont_Fax_1","AM018_Inspectiont_Email_1","AM018_Inspectiont_Address_2","AM018_Inspectiont_Department_2","AM018_Inspectiont_Position_2","AM018_Inspectiont_Person_2","AM018_Inspectiont_Tel_2","AM018_Inspectiont_Fax_2","AM018_Inspectiont_Email_2","AM018_Inspectiont_Address_3","AM018_Inspectiont_Department_3","AM018_Inspectiont_Position_3","AM018_Inspectiont_Person_3","AM018_Inspectiont_Tel_3","AM018_Inspectiont_Fax_3","AM018_Inspectiont_Email_3"]
[1,{"$f":"ETL!$D$61","v":""},{"$f":"ETL!$D$59","v":""},{"$f":"ETL!$G$62","v":""},{"$f":"ETL!$D$62","v":""},{"$f":"ETL!$D$64","v":""},{"$f":"ETL!$D$66","v":""},{"$f":"ETL!$D$13","v":""},{"$f":"ETL!$D$14","v":""},{"$f":"ETL!$D$15","v":""},{"$f":"ETL!$D$16","v":""},{"$f":"ETL!$D$12","v":""},{"$f":"ETL!$D$17","v":""},{"$f":"ETL!$D$18","v":""},{"$f":"ETL!$D$19","v":""},{"$f":"ETL!$D$21","v":""},{"$f":"ETL!$D$22","v":""},{"$f":"ETL!$D$23","v":""},{"$f":"ETL!$D$24","v":""},{"$f":"ETL!$D$20","v":""},{"$f":"ETL!$D$25","v":""},{"$f":"ETL!$D$26","v":""},{"$f":"ETL!$D$27","v":""},{"$f":"ETL!$D$29","v":""},{"$f":"ETL!$D$30","v":""},{"$f":"ETL!$D$31","v":""},{"$f":"ETL!$D$32","v":""},{"$f":"ETL!$D$28","v":""},{"$f":"ETL!$D$33","v":""},{"$f":"ETL!$D$34","v":""},{"$f":"ETL!$D$35","v":""}]
["↓セルA５はVBAのバージョン管理処理にて使用しているため修正時注意する"]
["様式20の数",{"$f":"ETL!$D$80","v":1}]
["No","AT005_PlantSiteCode","AT005_RelatesYear","AT005_ReportDay","AT005_TraderName","AT005_TraderAddress","AT005_ExportImportType","AT005_SubstancesType","AT005_GovOrdinance","AT005_CASRegistryNumber","AT005_ChemicalId","相手国の数(DBにはない項目)","AT005_CountryID1","AT005_QuantityCountry1","AT005_QuantityCountryValue1","AT005_CountryID2","AT005_QuantityCountry2","AT005_QuantityCountryValue2","AT005_CountryID3","AT005_QuantityCountry3","AT005_QuantityCountryValue3","AT005_CountryID4","AT005_QuantityCountry4","AT005_QuantityCountryValue4","AT005_CountryID5","AT005_QuantityCountry5","AT005_QuantityCountryValue5","AT005_CountryID6","AT005_QuantityCountry6","AT005_QuantityCountryValue6","AT005_CountryID7","AT005_QuantityCountry7","AT005_QuantityCountryValue7"]
[1,{"$f":"ETL!$D$61","v":""},{"$f":"ETL!$D$6","v":0},{"$f":"ETL!$G$3","v":{"$error":"#NUM!"}},{"$f":"ETL!$G$7","v":""},{"$f":"ETL!$D$11","v":""},{"$f":"ETL!$G$81","v":""},{"$f":"ETL!$G$86","v":""},{"$f":"ETL!$G$87","v":""},{"$f":"ETL!$G$82","v":""},{"$f":"ETL!$G$84","v":0},{"$f":"ETL!$D$88","v":1},{"$f":"ETL!$K$90","v":""},{"$f":"ETL!$I$90","v":"0"},{"$f":"ETL!$H$90","v":0},{"$f":"ETL!$K$91","v":""},{"$f":"ETL!$I$91","v":""},{"$f":"ETL!$H$91","v":0},{"$f":"ETL!$K$92","v":""},{"$f":"ETL!$I$92","v":""},{"$f":"ETL!$H$92","v":0},{"$f":"ETL!$K$93","v":""},{"$f":"ETL!$I$93","v":""},{"$f":"ETL!$H$93","v":0},{"$f":"ETL!$K$94","v":""},{"$f":"ETL!$I$94","v":""},{"$f":"ETL!$H$94","v":0},{"$f":"ETL!$K$95","v":""},{"$f":"ETL!$I$95","v":""},{"$f":"ETL!$H$95","v":0},{"$f":"ETL!$K$96","v":""},{"$f":"ETL!$I$96","v":""},{"$f":"ETL!$H$96","v":0}]
[2,{"$f":"IF($B$5>1,ETL!$D$61,\"\")","v":""},{"$f":"IF($B$5>1,ETL!$D$6, \"\")","v":""},{"$f":"IF($B$5>1,ETL!$G$3, \"\")","v":""},{"$f":"IF($B$5>1,ETL!$G$7, \"\")","v":""},{"$f":"IF($B$5>1,ETL!$D$11, \"\")","v":""},{"$f":"IF($B$5>1,ETL!$G$98, \"\")","v":""},{"$f":"IF($B$5>1,ETL!$G$103, \"\")","v":""},{"$f":"IF($B$5>1,ETL!$G$104, \"\")","v":""},{"$f":"IF($B$5>1,ETL!$G$99,\"\")","v":""},{"$f":"IF($B$5>1,ETL!$G$101, \"\")","v":""},{"$f":"ETL!$D$105","v":1},{"$f":"IF($B$5>1,ETL!$K$107, \"\")","v":""},{"$f":"IF($B$5>1,ETL!$I$107, \"\")","v":""},{"$f":"IF($B$5>1,ETL!$H$107, \"\")","v":""},{"$f":"IF($B$5>1,ETL!$K$108, \"\")","v":""},{"$f":"IF($B$5>1,ETL!$I$108, \"\")","v":""},{"$f":"IF($B$5>1,ETL!$H$108, \"\")","v":""},{"$f":"IF($B$5>1,ETL!$K$109, \"\")","v":""},{"$f":"IF($B$5>1,ETL!$I$109, \"\")","v":""},{"$f":"IF($B$5>1,ETL!$H$109,\"\")","v":""},{"$f":"IF($B$5>1,ETL!$K$110, \"\")","v":""},{"$f":"IF($B$5>1,ETL!$I$110, \"\")","v":""},{"$f":"IF($B$5>1,ETL!$H$110, \"\")","v":""},{"$f":"IF($B$5>1,ETL!$K$111, \"\")","v":""},{"$f":"IF($B$5>1,ETL!$I$111, \"\")","v":""},{"$f":"IF($B$5>1,ETL!$H$111, \"\")","v":""},{"$f":"IF($B$5>1,ETL!$K$112, \"\")","v":""},{"$f":"IF($B$5>1,ETL!$I$112, \"\")","v":""},{"$f":"IF($B$5>1,ETL!$H$112, \"\")","v":""},{"$f":"IF($B$5>1,ETL!$K$113, \"\")","v":""},{"$f":"IF($B$5>1,ETL!$I$113, \"\")","v":""},{"$f":"IF($B$5>1,ETL!$H$113, \"\")","v":""}]
[3,{"$f":"IF($B$5>2,ETL!$D$61,\"\")","v":""},{"$f":"IF($B$5>2,ETL!$D$6, \"\")","v":""},{"$f":"IF($B$5>2,ETL!$G$3, \"\")","v":""},{"$f":"IF($B$5>2,ETL!$G$7, \"\")","v":""},{"$f":"IF($B$5>2,ETL!$D$11, \"\")","v":""},{"$f":"IF($B$5>2,ETL!$G$115, \"\")","v":""},{"$f":"IF($B$5>2,ETL!$G$120, \"\")","v":""},{"$f":"IF($B$5>2,ETL!$G$121, \"\")","v":""},{"$f":"IF($B$5>2,ETL!$G$116,\"\")","v":""},{"$f":"IF($B$5>2,ETL!$G$118, \"\")","v":""},{"$f":"ETL!$D$122","v":1},{"$f":"IF($B$5>2,ETL!$K$124, \"\")","v":""},{"$f":"IF($B$5>2,ETL!$I$124, \"\")","v":""},{"$f":"IF($B$5>2,ETL!$H$124, \"\")","v":""},{"$f":"IF($B$5>2,ETL!$K$125, \"\")","v":""},{"$f":"IF($B$5>2,ETL!$I$125, \"\")","v":""},{"$f":"IF($B$5>2,ETL!$H$125, \"\")","v":""},{"$f":"IF($B$5>2,ETL!$K$126, \"\")","v":""},{"$f":"IF($B$5>2,ETL!$I$126, \"\")","v":""},{"$f":"IF($B$5>2,ETL!$H$126,\"\")","v":""},{"$f":"IF($B$5>2,ETL!$K$127, \"\")","v":""},{"$f":"IF($B$5>2,ETL!$I$127, \"\")","v":""},{"$f":"IF($B$5>2,ETL!$H$127, \"\")","v":""},{"$f":"IF($B$5>2,ETL!$K$128, \"\")","v":""},{"$f":"IF($B$5>2,ETL!$I$128, \"\")","v":""},{"$f":"IF($B$5>2,ETL!$H$128, \"\")","v":""},{"$f":"IF($B$5>2,ETL!$K$129, \"\")","v":""},{"$f":"IF($B$5>2,ETL!$I$129, \"\")","v":""},{"$f":"IF($B$5>2,ETL!$H$129, \"\")","v":""},{"$f":"IF($B$5>2,ETL!$K$130, \"\")","v":""},{"$f":"IF($B$5>2,ETL!$I$130, \"\")","v":""},{"$f":"IF($B$5>2,ETL!$H$130, \"\")","v":""}]
[4,{"$f":"IF($B$5>3,ETL!$D$61,\"\")","v":""},{"$f":"IF($B$5>3,ETL!$D$6, \"\")","v":""},{"$f":"IF($B$5>3,ETL!$G$3, \"\")","v":""},{"$f":"IF($B$5>3,ETL!$G$7, \"\")","v":""},{"$f":"IF($B$5>3,ETL!$D$11, \"\")","v":""},{"$f":"IF($B$5>3,ETL!$G$132, \"\")","v":""},{"$f":"IF($B$5>3,ETL!$G$137, \"\")","v":""},{"$f":"IF($B$5>3,ETL!$G$138, \"\")","v":""},{"$f":"IF($B$5>3,ETL!$G$133,\"\")","v":""},{"$f":"IF($B$5>3,ETL!$G$135, \"\")","v":""},{"$f":"ETL!$D$139","v":1},{"$f":"IF($B$5>3,ETL!$K$141, \"\")","v":""},{"$f":"IF($B$5>3,ETL!$I$141, \"\")","v":""},{"$f":"IF($B$5>3,ETL!$H$141, \"\")","v":""},{"$f":"IF($B$5>3,ETL!$K$142, \"\")","v":""},{"$f":"IF($B$5>3,ETL!$I$142, \"\")","v":""},{"$f":"IF($B$5>3,ETL!$H$142, \"\")","v":""},{"$f":"IF($B$5>3,ETL!$K$143, \"\")","v":""},{"$f":"IF($B$5>3,ETL!$I$143, \"\")","v":""},{"$f":"IF($B$5>3,ETL!$H$143,\"\")","v":""},{"$f":"IF($B$5>3,ETL!$K$144, \"\")","v":""},{"$f":"IF($B$5>3,ETL!$I$144, \"\")","v":""},{"$f":"IF($B$5>3,ETL!$H$144, \"\")","v":""},{"$f":"IF($B$5>3,ETL!$K$145, \"\")","v":""},{"$f":"IF($B$5>3,ETL!$I$145, \"\")","v":""},{"$f":"IF($B$5>3,ETL!$H$145, \"\")","v":""},{"$f":"IF($B$5>3,ETL!$K$146, \"\")","v":""},{"$f":"IF($B$5>3,ETL!$I$146, \"\")","v":""},{"$f":"IF($B$5>3,ETL!$H$146, \"\")","v":""},{"$f":"IF($B$5>3,ETL!$K$147, \"\")","v":""},{"$f":"IF($B$5>3,ETL!$I$147, \"\")","v":""},{"$f":"IF($B$5>3,ETL!$H$147, \"\")","v":""}]
{"$rows_left_out":18}
{"sheet":"ETL","index":4,"n_rows":198,"n_cols":12,"rows_kept":198,"cut":false,"hidden":true,"merged":[[42,0,48,0],[49,0,55,0],[57,0,57,2],[61,0,72,0],[1,0,1,2],[11,0,18,0],[19,0,26,0],[27,0,34,0],[35,0,41,0],[182,0,197,0],[75,0,75,2],[76,0,76,2],[97,0,112,0],[114,0,129,0],[131,0,146,0],[148,0,163,0],[165,0,180,0],[80,0,95,0],[78,0,78,2],[79,0,79,2]]}
["基本情報"]
["項目",null,null,"値",null,"データ変換","値"]
["届出日","年",null,{"$f":"基本情報・事業者情報の作成!$D$41","v":0},null,"届出年月日",{"$f":"DATE(D3,  D4, D5)","v":{"$error":"#NUM!"}}]
[null,"月",null,{"$f":"基本情報・事業者情報の作成!$I$41","v":0},null,null,{"$f":"CONCATENATE(TEXT($G$3,\"ggge年\"), \"(\", $D$3, ,\"年)\",$D$4,\"月\",$D$5,\"日\")","v":{"$error":"#NUM!"}}]
[null,"日",null,{"$f":"基本情報・事業者情報の作成!$L$41","v":0}]
["届出対象年",null,null,{"$f":"基本情報・事業者情報の作成!$D$44","v":0}]
["氏名または名称",null,null,{"$f":"基本情報・事業者情報の作成!$V$47&\"\"","v":""},null,"氏名、法人役職、氏名の結合",{"$f":"CONCATENATE(D7,IF(D9=\"\",\"\",CONCATENATE(\" \",D9)),IF(D10=\"\",\"\",CONCATENATE(\" \",D10)))","v":""}]
["氏名または名称（英語）",null,null,{"$f":"基本情報・事業者情報の作成!$W$47&\"\"","v":""},null,"法人役職、氏名の結合",{"$f":"CONCATENATE(D9,IF(D10=\"\",\"\",CONCATENATE(\" \",D10)))","v":""}]
["法人にあっては、\nその代表者の役職",null,null,{"$f":"基本情報・事業者情報の作成!$V$48&\"\"","v":""}]
["法人にあっては、\nその代表者の氏名",null,null,{"$f":"基本情報・事業者情報の作成!$V$49&\"\"","v":""}]
{"$rows_left_out":189}
{"sheet":"LIST","index":5,"n_rows":500,"n_cols":38,"rows_kept":500,"cut":false,"hidden":true,"merged":[[2,32,2,37],[3,20,3,21],[2,1,2,3],[2,12,2,13],[3,13,3,14],[2,8,2,9],[3,16,3,19]]}
[]
[null,null,null,null,null,null,null,null,null,null,null,null,null,null,null,null,null,null,null,null,null,null,null,null,null,"化学物質"]
[null,"都道府県コード",null,null,null,"定数",null,null,"数値の整形定義",null,null,null,"様式20",null,null,null,null,null,null,null,null,null,null,null,null,"政令番号の対応表",null,null,null,null,null,null,"物質（CAS番号ありの場合）"]
[null,"値","ID","英語",null,"値","意味",null,"元の値の位取り\n(log10)","DB登録文字列 decimal(16,7)","帳票\n有効数字3桁",null,"数","輸入または輸出の別",null,"相手国の数","相手国",null,null,null,"第一種、二種の区分",null,"指定物質番号\n（第一種指定物質）","指定物質番号\n（第二種指定物質）",null,"化兵法\n政令番号","政令番号","化兵法\n政令番号(1)","化兵法\n政令番号(2)","条約剤番号","物質名称（条約上）",null,"CAS番号","物質ID","政令番号","表区分ID","物質名称（日）","物質名称（英）"]
[null,"北海道",1,"Hokkaido",null,"CAS番号なし","物質選択などでCAS番号がない場合の選択肢。\n「STRING_NOCAS」で名前定義",null,-7,"#0.0000000","#0.000000000",null,1,"輸出","1",1,{"$f":"CONCATENATE($R5,IF($S5<>\"\",\"_\",\"\"),$S5)","v":"アイスランド_ISL"},"アイスランド","ISL",216,"第一種指定物質","1","毒性物質（一）","毒性物質（一）",null,{"$f":"CONCATENATE($AB5, IF($AC5<>\"\",\"_\",\"\"), $AC5)","v":"第一種指定物質_毒性物質（一）"},"指1毒01","第一種指定物質","毒性物質（一）","2A01","アミトン　O・O－ジエチル＝S-[２－（ジエチルアミノ）エチル]ホスホロチオラート　及びそのアルキル化塩類又はプロトン化塩類",null,{"$f":"STRING_NOCAS","v":"CAS番号なし"}]
[null,"青森県",2,"Aomori",null,null,null,null,-6,"#0.0000000","#0.00000000",null,2,"輸入","2",2,"アイルランド_IRL","アイルランド","IRL",72,"第二種指定物質","2","毒性物質（二）","毒性物質（二）",null,"第一種指定物質_毒性物質（二）","指1毒02","第一種指定物質","毒性物質（二）","2A02","ＰＦＩＢ　１・１・３・３・３－ペンタフルオロ－２－（トリフルオロメチル）－１－プロペン",null,"10025-67-9",1,"指2原08","3B12","一塩化硫黄","Sulfur monochloride"]
[null,"岩手県",3,"Iwate",null,null,null,null,-5,"#0.0000000","#0.0000000",null,3,null,null,3,"アゼルバイジャン_AZE","アゼルバイジャン","AZE",11,null,null,"毒性物質（三）","毒性物質（三）",null,"第一種指定物質_毒性物質（三）","指1毒03","第一種指定物質","毒性物質（三）","2A03","ＢＺ　３－キヌクリジニル＝ベンジラート",null,"10025-87-3",2,"指2原01","3B05","オキシ塩化リン","Phosphorus oxychloride"]
[null,"宮城県",4,"Miyagi",null,null,null,null,-4,"#0.000000","#0.000000",null,4,null,null,4,"アフガニスタン_AFG","アフガニスタン","AFG",1,null,null,"原料物質（一）","毒性物質（四）",null,"第一種指定物質_原料物質（一）","指1原01","第一種指定物質","原料物質（一）","2B04","毒性物質一のメチル、エチル又はプロピル（ノルマル又はイソ）と結合しているが、その結合以外に炭素原子とは結合していないリン原子を含有する化学物質（表１に掲げる物質を除く。）",null,"10026-13-8",3,"指2原03","3B07","五塩化リン","Phosphorus pentachloride"]
[null,"秋田県",5,"Akita",null,null,null,null,-3,"#0.00000","#0.00000",null,5,null,null,5,"アメリカ合衆国_USA","アメリカ合衆国","USA",175,null,null,"原料物質（二）","原料物質（一）",null,"第一種指定物質_原料物質（二）","指1原02","第一種指定物質","原料物質（二）","2B05","N・N－ジアルキル（メチル、エチル、ノルマルプロピル又はイソプロピル）ホスホルアミディック＝ジハリド類",null,"100-35-6",4,"指1原07","2B10","2-(N,N-Diethylamino)ethylchloride","2-(N,N-Diethylamino)ethylchloride"]
[null,"山形県",6,"Yamagata",null,null,null,null,-2,"#0.0000","#0.0000",null,6,null,null,6,"アラブ首長国連邦_ARE","アラブ首長国連邦","ARE",173,null,null,"原料物質（三）","原料物質（二）",null,"第一種指定物質_原料物質（三）","指1原03","第一種指定物質","原料物質（三）","2B06","ジアルキル（メチル、エチル、ノルマルプロピル又はイソプロピル）＝N・N－ジアルキル（メチル、エチル、ノルマルプロピル又はイソプロピル）ホスホルアミダート類",null,"100-38-9",5,"指1原09","2B12","２－ジエチルアミノエタンチオール","2-(N,N-Diethylamino)ethanethiol"]
{"$rows_left_out":491}
{"sheet":"【自動入力】様式第20","index":6,"n_rows":216,"n_cols":32,"rows_kept":216,"cut":false,"hidden":false,"merged":[[216,5,216,32],[213,14,213,23],[213,24,213,30],[213,31,213,32],[214,14,214,23],[214,24,214,30],[214,31,214,32],[210,24,210,30],[210,31,210,32],[211,14,211,23],[211,24,211,30],[211,31,211,32],[212,14,212,23],[212,24,212,30],[212,31,212,32],[207,1,214,13],[207,14,207,23],[207,24,207,32],[208,14,208,23],[208,24,208,30],[208,31,208,32],[209,14,209,23],[209,24,209,30],[209,31,209,32],[210,14,210,23],[202,1,202,32],[204,1,205,13],[204,14,204,32],[205,14,205,32],[206,1,206,13],[206,14,206,32],[194,1,194,21],[195,10,197,18],[195,20,195,31],[197,20,197,32],[199,10,199,18],[199,20,199,31],[185,5,185,32],[188,1,188,32],[191,0,191,18],[181,14,181,23],[181,24,181,30],[181,31,181,32],[182,14,182,23],[182,24,182,30],[182,31,182,32],[191,23,191,32],[178,31,178,32],[179,14,179,23],[179,24,179,30],[179,31,179,32],[180,14,180,23],[180,24,180,30],[180,31,180,32],[175,1,175,13],[175,14,175,32],[176,1,183,13],[176,14,176,23],[176,24,176,32],[177,14,177,23],[177,24,177,30],[177,31,177,32],[178,14,178,23],[178,24,178,30],[183,14,183,23],[183,24,183,30],[183,31,183,32],[168,10,168,18],[168,20,168,31],[171,1,171,32],[173,1,174,13],[173,14,173,32],[174,14,174,32],[154,5,154,32],[157,1,157,32],[160,0,160,18],[163,1,163,21],[164,10,166,18],[164,20,164,31],[166,20,166,32],[160,23,160,32],[165,32,165,33],[145,1,152,13],[145,14,145,23],[145,24,145,32],[146,14,146,23],[146,24,146,30],[146,31,146,32],[147,14,147,23],[147,24,147,30],[147,31,147,32],[148,14,148,23],[151,14,151,23],[151,24,151,30],[151,31,151,32],[152,14,152,23],[152,24,152,30],[152,31,152,32],[148,24,148,30],[148,31,148,32],[149,14,149,23],[149,24,149,30],[149,31,149,32],[150,14,150,23],[150,24,150,30],[150,31,150,32],[140,1,140,32],[142,1,143,13],[142,14,142,32],[143,14,143,32],[144,1,144,13],[144,14,144,32],[132,1,132,21],[133,10,135,18],[133,20,133,31],[135,20,135,32],[137,10,137,18],[137,20,137,31],[123,5,123,32],[126,1,126,32],[129,0,129,18],[119,14,119,23],[119,24,119,30],[119,31,119,32],[120,14,120,23],[120,24,120,30],[120,31,120,32],[129,23,129,32],[116,31,116,32],[117,14,117,23],[117,24,117,30],[117,31,117,32],[118,14,118,23],[118,24,118,30],[118,31,118,32],[113,1,113,13],[113,14,113,32],[114,1,121,13],[114,14,114,23],[114,24,114,32],[115,14,115,23],[115,24,115,30],[115,31,115,32],[116,14,116,23],[116,24,116,30],[121,14,121,23],[121,24,121,30],[121,31,121,32],[106,10,106,18],[106,20,106,31],[109,1,109,32],[111,1,112,13],[111,14,111,32],[112,14,112,32],[92,5,92,32],[95,1,95,32],[98,0,98,18],[101,1,101,21],[102,10,104,18],[102,20,102,31],[104,20,104,32],[98,23,98,32],[83,1,90,13],[83,14,83,23],[83,24,83,32],[84,14,84,23],[84,24,84,30],[84,31,84,32],[85,14,85,23],[85,24,85,30],[85,31,85,32],[86,14,86,23],[89,14,89,23],[89,24,89,30],[89,31,89,32],[90,14,90,23],[90,24,90,30],[90,31,90,32],[86,24,86,30],[86,31,86,32],[87,14,87,23],[87,24,87,30],[87,31,87,32],[88,14,88,23],[88,24,88,30],[88,31,88,32],[78,1,78,32],[80,1,81,13],[80,14,80,32],[81,14,81,32],[82,1,82,13],[82,14,82,32],[70,1,70,21],[71,10,73,18],[71,20,71,31],[73,20,73,32],[75,10,75,18],[75,20,75,31],[61,5,61,32],[64,1,64,32],[67,0,67,18],[57,14,57,23],[57,24,57,30],[57,31,57,32],[58,14,58,23],[58,24,58,30],[58,31,58,32],[67,23,67,32],[54,31,54,32],[55,14,55,23],[55,24,55,30],[55,31,55,32],[56,14,56,23],[56,24,56,30],[56,31,56,32],[51,1,51,13],[51,14,51,32],[52,1,59,13],[52,14,52,23],[52,24,52,32],[53,14,53,23],[53,24,53,30],[53,31,53,32],[54,14,54,23],[54,24,54,30],[59,14,59,23],[59,24,59,30],[59,31,59,32],[44,10,44,18],[44,20,44,31],[47,1,47,32],[49,1,50,13],[49,14,49,32],[50,14,50,32],[33,1,33,32],[36,0,36,18],[39,1,39,21],[40,10,42,18],[40,20,40,31],[42,20,42,32],[36,23,36,32],[30,5,30,32],[9,10,11,18],[13,10,13,18],[26,14,26,23],[26,24,26,30],[26,31,26,32],[27,14,27,23],[27,24,27,30],[27,31,27,32],[23,31,23,32],[24,14,24,23],[24,24,24,30],[24,31,24,32],[25,14,25,23],[25,24,25,30],[25,31,25,32],[20,1,20,13],[20,14,20,32],[21,1,28,13],[21,14,21,23],[21,24,21,32],[23,14,23,23],[23,24,23,30],[16,1,16,32],[0,32,0,33],[18,1,19,13],[18,14,18,32],[19,14,19,32],[28,14,28,23],[28,24,28,30],[28,31,28,32],[13,20,13,31],[2,1,2,32],[5,0,5,18],[8,1,8,21],[9,20,9,31],[11,20,11,32],[22,14,22,23],[22,24,22,30],[22,31,22,32],[5,23,5,32]]}
["（別紙様式１）","様式第２０（第２１条関係）"]
[]
[null,{"$f":" CONCATENATE(ETL!$D$81, \"実績届出書\")","v":"実績届出書"}]
[]
[]
[null,null,null,null,null,null,null,null,null,null,null,null,null,null,null,null,null,null,null,null,null,null,null,{"$f":"ETL!$G$4","v":{"$error":"#NUM!"}}]
[]
[]
[null,"経済産業大臣殿"]
[null,null,null,null,null,null,null,null,null,null,"氏名又は名称及び法人にあっては、その代表者の氏名",null,null,null,null,null,null,null,null,null,{"$f":"ETL!$D$7","v":""}]
{"$rows_left_out":206}