{"text_format":"1","workbook":"xlsx","n_sheets":8,"sheets":["使い方","チェックシート","可視化結果","可視化結果（広域機関用）","設問集計結果（広域機関用）","フィルター個数確認","事業者とガイドラインの対応関係","選択肢"],"not_rendered":{"charts":7,"images":3,"macros":1,"external_links":0,"defined_names":2,"comments":0,"pivot_tables":0},"unopened":[],"bounds":{"document_bytes":16777216,"sheet_cells":100000,"rows_first":2000,"rows_last":500,"rows_between":2000,"halvings":0,"cell_chars":16384,"cell_head_chars":4096},"cells_cut":0,"cells_raw":0,"read":"whole","date_system":"1900"}

{"sheet":"使い方","index":0,"n_rows":91,"n_cols":2,"rows_kept":91,"cut":false,"hidden":false,"merged":[[90,1,99,12],[1,1,2,12],[19,1,21,12],[24,1,38,12],[89,0,89,12],[59,1,61,12],[62,1,66,12],[4,0,4,12],[13,0,13,12],[5,1,11,12],[14,1,16,12],[18,0,18,12]]}
[]
[null,"電力システムにおけるサイバーセキュリティ対策状況可視化ツール　使い方"]
[]
[]
["1. 本可視化ツールの目的・位置付け"]
[null,"本可視化ツールは、電力会社において、簡易的にサイバーセキュリティリスク点検を実施することを目的として開発されました。本可視化ツールの活用方法や本可視化ツールに基づくリスク点検の進め方については、付随する「電力システムにおけるサイバーセキュリティリスク点検ガイド」（ガイド）をご確認ください。なお、本可視化ツールのリスク点検項目は米国NISTのCybersecurity Framework（NIST CSF）Version 1.1を参考に整理しています。\n日々進化・巧妙化するサイバー脅威に対抗するために、ガイド及び対策状況可視化ツールを用いて自社の対策実施状況を点検・確認するとともに、点検結果に基づきセキュリティ対策の見直し・改善を行うことで、対策の継続的改善を図ることが期待されます。"]
[]
[]
[]
[]
[]
[]
[]
["2. 対象事業者"]
[null,"ガイド及び対策状況可視化ツールでは、発電事業者、小売電気事業者、アグリゲーター（アグリゲーションコーディネーター及びリソースアグリゲーター）及び自家用電気工作物設備設置者の4事業区分を主な対象としています。ただし、その他の事業区分でも活用可能です。"]
{"$rows_left_out":77}
{"sheet":"チェックシート","index":1,"n_rows":124,"n_cols":32,"rows_kept":124,"cut":false,"hidden":false,"merged":[[5,23,5,29],[1,8,4,10]]}
[]
[null,null,null,null,"会社名",null,null,null,"X列の上に+ボタンを押していただくと追加の選択肢記入・選択理由が表示されます。以下のような目的で適宜利用ください。\n・回答者ごとに選択肢の列を分けたい\n・複数の立場（経営層、セキュリティ担当部署、担当業務部署、現場担当者など）での回答結果を比較したい\n※可視化についてはJ列のみが適用されていますので、最終的なスコアについては、J列に記載ください。"]
[null,null,null,null,"活用区分","全て表示"]
[null,null,null,null,"点検対象システム名"]
[null,null,null,"※ 右A~Bの項目は広域機関提出時に記入ください。","A. 事業者コード",null,"B. 事業者種別\n※ すべて選択してください"]
[{"$f":"COLUMN(X8)","v":24},null,null,null,null,null,null,null,null,null,null,null,null,null,null,null,null,null,null,null,null,null,null,"関連するガイドライン項目"]
["ア","機能","カテゴリー","サブカテゴリー","リスク点検項目","対策を怠った場合に想定されるリスク","対象","達成基準","担当領域","選択肢記入","選択理由（社内文書の参照先等）","選択肢記入\n（回答者名）","選択理由","選択肢記入\n（回答者名）","選択理由","選択肢記入\n（回答者名）","選択理由","選択肢記入\n（回答者名）","選択理由","選択肢記入\n（回答者名）","選択理由","選択肢記入\n（回答者名）","選択理由","電力制御システム\nセキュリティガイドライン\n（JEAG1111-2019）","ERABに関する\nサイバーセキュリティ\nガイドライン Ver 2.0","小売電気事業者のための\nサイバーセキュリティ対策\nガイドライン Ver 1.0","系統連系技術要件\n【託送供給等約款別冊】","自家用電気工作物に係るサイバーセキュリティの確保に関するガイドライン（内規）","特定卸供給事業に係るサイバーセキュリティ確保の指針","サイバーセキュリティ\n経営ガイドライン Ver 2.0","広域提出用","表示制御用"]
[{"$f":"COLUMN(X8)&X8&COLUMN(Y8)&Y8&COLUMN(Z8)&Z8&COLUMN(AA8)&AA8&COLUMN(AC8)&AC8&COLUMN(AE8)&AE8&COLUMN(#REF!)&#REF!","v":{"$error":"#REF!"}},"識別（ID）","資産管理","ID.AM-1","自組織内の物理デバイスとシステムが、目録作成されている。\n(ハードウェア資産とそれらのセキュリティに関連する情報を把握・更新している。)","自組織内の物理デバイスのサポート期限切れが把握できず、デバイスの脆弱性を利⽤しマルウェア感染され、保護すべきデータが漏えい・改ざんされる可能性がある。","情報システム/電力制御システム","\n0.\n 対応なし\n1.\n システムの構成機器一覧が作成され、それらのセキュリティに関連する情報（機器の設置場所、サポートベンダーやサポート期限　等）が把握されている。\n2.\n 1に加え、システムの構成機器一覧が更新されている。\n3.\n 2に加え、システムの構成機器一覧は、会社が定めたシステム管理台帳で管理することが文書で規定され、管理すべき情報が明確化されている。\n4.\n 3に加え、システム管理台帳で管理すべき項目及び内容は、定期的に見直されている。\n","情報セキュリティ/IT、制御セキュリティ/OT","未選択",null,null,null,null,null,null,null,null,null,null,null,null,null,"第3-1条(勧告)","3.6(勧告)","指示4","-","第3-1条(推奨)","(2)-ア","指示4",4,{"$f":"IF($F$3=\"\",\"〇\",IF($F$3=\"全て表示\",\"〇\",IF(AND($F$3=\"発電事業者\",OR($X8<>\"-\",$X8<>\"-\")),\"〇\",IF(AND($F$3=\"小売電気事業者\",OR($Z8<>\"-\",$Z8<>\"-\")),\"〇\",IF(AND($F$3=\"自家用電気工作物設置者\",OR($AA8<>\"-\",$AB8<>\"-\")),\"〇\",IF(AND($F$3=\"アグリゲーター\",OR($Y8<>\"-\",$AC8<>\"-\")),\"〇\",IF(AND($F$3=\"広域機関提出用\",OR($AE8<>\"-\",$AE8<>\"-\")),\"〇\",\"×\")))))))","v":"〇"}]
[{"$f":"COLUMN(X9)&X9&COLUMN(Y9)&Y9&COLUMN(Z9)&Z9&COLUMN(AA9)&AA9&COLUMN(AC9)&AC9&COLUMN(AE9)&AE9&COLUMN(#REF!)&#REF!","v":{"$error":"#REF!"}},"識別（ID）","資産管理","ID.AM-2","自組織内のソフトウェアプラットフォームとアプリケーションが、目録作成されている。\n(ソフトウェア資産とそれらのセキュリティに関連する情報を把握・更新している。)","自組織内で利用しているソフトウェアに対してセキュリティパッチが正しく適用されず、ソフトウェアの脆弱性を利⽤しマルウェア感染され、保護すべきデータが漏えい・改ざんされる可能性がある。","情報システム/電力制御システム","\n0.\n 対応なし\n1.\n システムのソフトウェア一覧が作成され、セキュリティに関連する情報（バージョン、セキュリティパッチの適用状況、、サポートベンダー、サポート期限等）が把握されている。\n2.\n 1に加え、システムのソフトウェア一覧が更新されている。\n3.\n 2に加え、システムのソフトウェア一覧は、会社が定めたシステム管理台帳で管理することが文書で規定され、管理すべき情報が明確化されている。\n4.\n 3に加え、システム管理台帳で管理すべき項目及び内容は、定期的に見直されている。\n","情報セキュリティ/IT、制御セキュリティ/OT","未選択",null,null,null,null,null,null,null,null,null,null,null,null,null,"第3-1条(勧告)","3.6(勧告)","指示4","-","第3-1条(推奨)","(2)-ア","指示4",4,{"$f":"IF($F$3=\"\",\"〇\",IF($F$3=\"全て表示\",\"〇\",IF(AND($F$3=\"発電事業者\",OR($X9<>\"-\",$X9<>\"-\")),\"〇\",IF(AND($F$3=\"小売電気事業者\",OR($Z9<>\"-\",$Z9<>\"-\")),\"〇\",IF(AND($F$3=\"自家用電気工作物設置者\",OR($AA9<>\"-\",$AB9<>\"-\")),\"〇\",IF(AND($F$3=\"アグリゲーター\",OR($Y9<>\"-\",$AC9<>\"-\")),\"〇\",IF(AND($F$3=\"広域機関提出用\",OR($AE9<>\"-\",$AE9<>\"-\")),\"〇\",\"×\")))))))","v":"〇"}]
[{"$f":"COLUMN(X10)&X10&COLUMN(Y10)&Y10&COLUMN(Z10)&Z10&COLUMN(AA10)&AA10&COLUMN(AC10)&AC10&COLUMN(AE10)&AE10&COLUMN(#REF!)&#REF!","v":{"$error":"#REF!"}},"識別（ID）","資産管理","ID.AM-3","組織内の通信とデータフロー図が、作成されている。\n(ネットワーク構成と各通信先を把握・更新している。)","ネットワーク構成の認識不足により、意図しない通信先より不正アクセスされて、自組織が適切に事業継続できない可能性がある。","情報システム/電力制御システム","\n0.\n 対応なし\n1.\n ネットワーク構成及びシステムの通信先に関する情報が把握されている。\n2.\n 1に加え、ネットワーク構成及びシステムの通信先に関する情報が更新されている。\n3.\n 2に加え、ネットワーク構成及びシステムの通信先に関する情報は、会社が定めたシステム管理台帳で管理することが文書で規定され、管理すべき情報が明確化されている。\n4.\n 3に加え、システム管理台帳で管理すべき項目及び内容は、定期的に見直されている。\n","情報セキュリティ/IT、制御セキュリティ/OT","未選択",null,null,null,null,null,null,null,null,null,null,null,null,null,"第3-1条(勧告)","3.6(勧告)","指示4","-","第3-1条(推奨)","(2)-ア","指示4",4,"〇"]
[{"$f":"COLUMN(X11)&X11&COLUMN(Y11)&Y11&COLUMN(Z11)&Z11&COLUMN(AA11)&AA11&COLUMN(AC11)&AC11&COLUMN(AE11)&AE11&COLUMN(#REF!)&#REF!","v":{"$error":"#REF!"}},"識別（ID）","資産管理","ID.AM-4","外部情報システムが、カタログ作成されている。\n(外部連携先システムを把握・更新している。)","意図しない外部情報システムからの接続により、通信経路上でデータを改ざんする中間者攻撃を受けて、保護すべきデータが漏えい・改ざんされる可能性がある。","情報システム","\n0.\n 対応なし\n1.\n 外部情報システム（クラウド等社外に設置された当社のシステム、当社システムが連携する他社が管理するシステム等）の一覧が作成されている。\n2.\n 1に加え、外部情報システムの一覧が更新されている。\n3.\n 2に加え、外部情報システムの一覧は、会社が定めたシステム管理台帳で管理することが文書で規定され、管理すべき情報が明確化されている。\n4.\n 3に加え、システム管理台帳で管理すべき項目及び内容は、定期的に見直されている。\n","情報セキュリティ/IT","未選択",null,null,null,null,null,null,null,null,null,null,null,null,null,"第3-1条(勧告)","3.6(勧告)","指示4","-","第3-1条(推奨)","(2)-ア","指示4",4,"〇"]
[{"$f":"COLUMN(X12)&X12&COLUMN(Y12)&Y12&COLUMN(Z12)&Z12&COLUMN(AA12)&AA12&COLUMN(AC12)&AC12&COLUMN(AE12)&AE12&COLUMN(#REF!)&#REF!","v":{"$error":"#REF!"}},"識別（ID）","資産管理","ID.AM-5","リソース（例:ハードウェア、デバイス、データ、ソフトウェア）が、それらの分類、重要度、ビジネス上の価値に基づいて優先順位付けられている。\n(システム資産・情報資産に対する重要度分類基準があり、資産はこれに基づいて分類されている。また、これらの基準が更新されている。)","システムの管理不足により、認識していないシステムが高負荷攻撃を受けて、自組織のシステムが停止する可能性がある。","情報システム/電力制御システム","\n0.\n 対応なし\n1.\n システム及び取扱い情報の重要度分類が行われ、その一覧が作成されている。\n2.\n 1に加え、重要度分類されたシステム及び取扱い情報の一覧が更新されている。\n3.\n 2に加え、システム及び取扱い情報の重要度分類を、会社が定めたシステム管理台帳で管理することが文書で規定され、管理すべき情報が明確化されている。\n4.\n 3に加え、システム管理台帳で管理すべき項目及び内容は、定期的に見直されている。\n","情報セキュリティ/IT、制御セキュリティ/OT","未選択",null,null,null,null,null,null,null,null,null,null,null,null,null,"第1-5条\n第6-2条(推奨)","3.5(勧告)","指示4","-","第1-3条\n第8-2条(推奨)","(5)-イ","指示4",4,"〇"]
[{"$f":"COLUMN(X13)&X13&COLUMN(Y13)&Y13&COLUMN(Z13)&Z13&COLUMN(AA13)&AA13&COLUMN(AC13)&AC13&COLUMN(AE13)&AE13&COLUMN(#REF!)&#REF!","v":{"$error":"#REF!"}},"識別（ID）","資産管理","ID.AM-6","全従業員及び利害関係にある第三者（例:サプライヤー、顧客、パートナー）に対してのサイバーセキュリティ上の役割と責任が、定められている。\n(システムの関係者に対し、セキュリティ上の役割と責任を定めている。)","他組織で発生したセキュリティインシデントにより、自組織が適切に事業継続できない可能性がある。","情報システム/電力制御システム","\n0.\n 対応なし\n1.\n ・会社のシステムセキュリティの最終的な責任は経営層にあることが明確にされている。\n ・個々のシステムについて、セキュリティ責任者が決定されている。　　\n ・個々のシステム開発及び運用において、サイバーセキュリティが考慮され、対応されている。（例として、開発におけるセキュリティ設計、運用におけるセキュリティ管理策の実践等）\n2.\n 1に加え、個々のシステム開発及び運用に関わる各組織において、セキュリティ上の役割と責任が文書等で明確化され、関係者に伝えられている。またセキュリティ責任者を文書で明確化している。\n3.\n 2に加え、個々のシステムにおけるセキュリティ責任者、システム開発や運用におけるセキュリティ上の責任者について、会社が定めた文書で管理することが規定され、管理すべき情報が明確化されている。\n4.\n 3に加え、文書で管理すべき項目及び内容は、定期的に見直されている。\n","情報セキュリティ/IT、制御セキュリティ/OT、リスク/法務","未選択",null,null,null,null,null,null,null,null,null,null,null,null,null,"第2-2条(勧告)","4.1(勧告)","指示9","〇","第2-2条の1(A:勧告 BC:推奨)\n第2-2条の2(推奨)\n第2-2条の3(推奨)","(1)-イ","指示9","-","〇"]
[{"$f":"COLUMN(X14)&X14&COLUMN(Y14)&Y14&COLUMN(Z14)&Z14&COLUMN(AA14)&AA14&COLUMN(AC14)&AC14&COLUMN(AE14)&AE14&COLUMN(#REF!)&#REF!","v":{"$error":"#REF!"}},"識別（ID）","ビジネス環境","ID.BE-1","サプライチェーンにおける自組織の役割が、識別され、周知されている。\n(自社のサプライチェーン全体における組織の役割を特定し、社内の関係者やサプライヤーとの間で共有されている。)","自組織のセキュリティインシデントにより、取引関係者が適切に事業継続できない可能性がある。","情報システム/電力制御システム","\n0.\n 対応なし\n1.\n 重要な顧客が明確にされている。\n2.\n 1に加え、\n ・社内の個々の組織が担う役割と責任が文書等で明確にされている。\n ・依存関係にある重要なサプライヤーが明確にされている。\n3.\n 2に加え、\n ・社内のリスク管理基準が文書等で明確にされている。\n ・各サプライヤーとの契約とサービス提供の管理、保守、モニタリングが行われている。\n4.\n 3に加え、\n ・社会情勢や経営環境の変化（大規模な事故・災害、規制緩和や市場自由化等）に伴い、社内のリスク管理基準が見直されている。　　\n ・サプライヤーの全体的な成果、契約要件との適合、費用に対する価値に関して、定期的にレビューを行い、発見された問題に対処している。\n","リスク/法務","未選択",null,null,null,null,null,null,null,null,null,null,null,null,null,"第2-1条(勧告)\n第2-2条(勧告)\n第4-1条(勧告)\n第7-2条(勧告)","-","指示9","-","第2-2条の2(推奨)\n第2-2条の3(推奨)\n第4-1条(推奨)\n第10-2条(推奨)","(1)-ア\n(1)-イ\n(3)-ア\n(6)-イ","指示9","-","〇"]
[{"$f":"COLUMN(X15)&X15&COLUMN(Y15)&Y15&COLUMN(Z15)&Z15&COLUMN(AA15)&AA15&COLUMN(AC15)&AC15&COLUMN(AE15)&AE15&COLUMN(#REF!)&#REF!","v":{"$error":"#REF!"}},"識別（ID）","ビジネス環境","ID.BE-2","重要インフラとその産業分野における自組織の位置づけが、識別され、周知されている。\n(経営戦略・事業ニーズ等を基に策定されたシステム戦略やシステムアーキテクチャが社内に周知されている。)","自組織のセキュリティインシデントにより、関係する他組織が適切に事業継続できない可能性がある。","情報システム/電力制御システム","\n0.\n 対応なし\n1.\n 事業ニーズに基づきシステム戦略が策定され、社内に周知されている。\n2.\n 1に加え、システム戦略とその優先度が経営戦略に基づいて決定され、文書等で明確にされている。\n3.\n 2に加え、会社の達成目標と戦略目標を満たす、システムエンタプライズアーキテクチャが定められ、社内に周知されている。\n4.\n 3に加え、社会情勢や経営環境の変化（大規模な事故・災害、規制緩和や市場自由化等）に伴い、システムエンタプライズアーキテクチャが見直されている。\n","情報セキュリティ/IT、制御セキュリティ/OT","未選択",null,null,null,null,null,null,null,null,null,null,null,null,null,"-","-","-","-","-","-","-","-","〇"]
{"$rows_left_out":110}
{"sheet":"可視化結果","index":2,"n_rows":142,"n_cols":4,"rows_kept":142,"cut":false,"hidden":false,"merged":[[2,2,2,3]]}
["セキュリティ対策状況可視化結果"]
[{"$f":"IFERROR(IF(チェックシート!F3=事業者とガイドラインの対応関係!A2,事業者とガイドラインの対応関係!J2,IF(チェックシート!F3=事業者とガイドラインの対応関係!A3,事業者とガイドラインの対応関係!J3,IF(チェックシート!F3=事業者とガイドラインの対応関係!A4,事業者とガイドラインの対応関係!J4,IF(チェックシート!F3=事業者とガイドラインの対応関係!A5,事業者とガイドラインの対応関係!J5,IF(チェックシート!F3=事業者とガイドラインの対応関係!A6,事業者とガイドラインの対応関係!J6,IF(チェックシート!F3=事業者とガイドラインの対応関係!A7,事業者とガイドラインの対応関係!J7,\"※現在のスコアは、すべてのリスク点検項目に基づき評価している。\")))))),\"※現在のスコアは、すべてのリスク点検項目に基づき評価している。\")","v":"※現在のスコアは、すべてのリスク点検項目に基づき評価している。"}]
[null,null,"※カテゴリー・サブカテゴリーに対応付けされた項目がない場合は該当の行がグレーアウトされます。"]
["目次",null,"目次"]
["全カテゴリのスコア（特定・防御・検知・対応・復旧）",null,"全機能"]
["識別（ID）のスコア",null,"機能","平均スコア※"]
["防御（PR）のスコア",null,"識別（ID）",{"$f":"IFERROR(SUBTOTAL(1,チェックシート!J8:J36),0)","v":0}]
["検知（DE）のスコア",null,"防御（PR）",{"$f":"IFERROR(SUBTOTAL(1,チェックシート!J37:J75),0)","v":0}]
["対応（RS）のスコア",null,"検知（DE）",{"$f":"IFERROR(SUBTOTAL(1,チェックシート!J76:J93),0)","v":0}]
["復旧（RC）のスコア",null,"対応（RS）",{"$f":"IFERROR(SUBTOTAL(1,チェックシート!J94:J109),0)","v":0}]
[null,null,"復旧（RC）",{"$f":"IFERROR(SUBTOTAL(1,チェックシート!J110:J115),0)","v":0}]
[]
[]
[]
[]
{"$rows_left_out":128}
{"sheet":"可視化結果（広域機関用）","index":3,"n_rows":19,"n_cols":4,"rows_kept":19,"cut":false,"hidden":false,"merged":[[18,0,18,5],[1,1,1,2],[2,1,2,2],[0,0,0,2]]}
["情報セキュリティ対策自己診断結果"]
["会社名",{"$f":"IF(チェックシート!F2=0,\"\",チェックシート!F2)","v":""}]
["事業者コード",{"$f":"IF(チェックシート!F5=0,\"\",チェックシート!F5)","v":""}]
[]
["チェック項目","平均スコア※","対象サブカテゴリー名"]
["１：情報セキュリティリスクの認識、組織全体での対応方針の策定",{"$f":"AVERAGEIF(チェックシート!AE:AE,D6,チェックシート!J:J)","v":{"$error":"#DIV/0!"}},"ID.GV-1,3\nDE.DP-2",1]
["２：情報セキュリティリスク管理体制の構築",{"$f":"AVERAGEIF(チェックシート!AE:AE,D7,チェックシート!J:J)","v":{"$error":"#DIV/0!"}},"ID.GV-2,4",2]
["３：情報セキュリティ対策のための資源（予算、人材等）確保",{"$f":"AVERAGEIF(チェックシート!AE:AE,D8,チェックシート!J:J)","v":{"$error":"#DIV/0!"}},"PR.AT-1~5",3]
["４：情報セキュリティリスクの把握とリスク対応に関する計画の策定",{"$f":"AVERAGEIF(チェックシート!AE:AE,D9,チェックシート!J:J)","v":{"$error":"#DIV/0!"}},"ID.AM-1~5\nID.RA-1,3~6\nID.RM-1~3",4]
["５：情報セキュリティリスクに対応するための仕組みの構築",{"$f":"AVERAGEIF(チェックシート!AE:AE,D10,チェックシート!J:J)","v":{"$error":"#DIV/0!"}},"PR.AC-1~7\nPR.AT-1\nPR.DS1~8\nPR.IP-12\nDE.AE-1,4,5\nDE.DP-1,3,4,5",5]
["６：情報セキュリティ対策におけるPDCAサイクルの実施",{"$f":"AVERAGEIF(チェックシート!AE:AE,D11,チェックシート!J:J)","v":{"$error":"#DIV/0!"}},"PR.IP-7",6]
["７：インシデント発生時の緊急対応体制の整備",{"$f":"AVERAGEIF(チェックシート!AE:AE,D12,チェックシート!J:J)","v":{"$error":"#DIV/0!"}},"RS.CO-1~5\nPR.IP-9,10\nRS.RP-1\nRS.IM-1,2",7]
["８：情報共有活動への参加を通じた攻撃情報の入手とその有効活用及び提供",{"$f":"AVERAGEIF(チェックシート!AE:AE,D13,チェックシート!J:J)","v":{"$error":"#DIV/0!"}},"ID.RA-2",8]
["９：電力広域的運営推進機関提供の情報システムを利用する際のクライアント証明書の管理について",{"$f":"AVERAGEIF(チェックシート!AE:AE,D14,チェックシート!J:J)","v":{"$error":"#DIV/0!"}},"OCCTO-1\nOCCTO-2",9]
["１０：クライアント証明書をインストールしたPCの管理について",{"$f":"AVERAGEIF(チェックシート!AE:AE,D15,チェックシート!J:J)","v":{"$error":"#DIV/0!"}},"OCCTO-3\nOCCTO-4",10]
{"$rows_left_out":5}
{"sheet":"設問集計結果（広域機関用）","index":4,"n_rows":5,"n_cols":88,"rows_kept":5,"cut":false,"hidden":false,"merged":[]}
[null,null,null,null,null,null,null,null,"チェック項目別結果",null,null,null,null,null,null,null,null,null,null,null,"サブカテゴリー別（項目1）",null,null,"サブカテゴリー別（項目2）",null,"サブカテゴリー別（項目3）",null,null,null,null,"サブカテゴリー別（項目4）",null,null,null,null,null,null,null,null,null,null,null,null,"サブカテゴリー別（項目5）",null,null,null,null,null,null,null,null,null,null,null,null,null,null,null,null,null,null,null,null,null,null,null,"サブカテゴリー別（項目6）","サブカテゴリー別（項目7）",null,null,null,null,null,null,null,null,null,"サブカテゴリー別（項目8）","サブカテゴリー別（項目9）",null,"サブカテゴリー別（項目10）",null,"サブカテゴリー別（項目11）",null,"サブカテゴリー別（項目12）"]
["事業者名","事業者コード","発電","小売電気","一般送配電","送電","特定送配電","登録特定送配電",1,2,3,4,5,6,7,8,9,10,11,12,"ID.GV-1","ID.GV-3","DE.DP-2","ID.GV-2","ID.GV-4","PR.AT-1","PR.AT-2","PR.AT-3","PR.AT-4","PR.AT-5","ID.AM-1","ID.AM-2","ID.AM-3","ID.AM-4","ID.AM-5","ID.RA-1","ID.RA-3","ID.RA-4","ID.RA-5","ID.RA-6","ID.RM-1","ID.RM-2","ID.RM-3","PR.AC-1","PR.AC-2","PR.AC-3","PR.AC-4","PR.AC-5","PR.AC-6","PR.AC-7","PR.AT-1","PR.DS-1","PR.DS-2","PR.DS-3","PR.DS-4","PR.DS-5","PR.DS-6","PR.DS-7","PR.DS-8","PR.IP-12","DE.AE-1","DE.AE-4","DE.AE-5","DE.DP-1","DE.DP-3","DE.DP-4","DE.DP-5","PR.IP-7","RS.CO-1","RS.CO-2","RS.CO-3","RS.CO-4","RS.CO-5","PR.IP-9","PR.IP-10","RS.RP-1","RS.IM-1","RS.IM-2","ID.RA-2","OCCTO-1","OCCTO-2","OCCTO-3","OCCTO-4","OCCTO-5","OCCTO-6","OCCTO-7","OCCTO-8","OCCTO-9"]
[{"$f":"チェックシート!F2","v":0},{"$f":"チェックシート!F5","v":0},false,false,false,false,false,false,{"$f":"'可視化結果（広域機関用）'!B6","v":{"$error":"#DIV/0!"}},{"$f":"'可視化結果（広域機関用）'!B7","v":{"$error":"#DIV/0!"}},{"$f":"'可視化結果（広域機関用）'!B8","v":{"$error":"#DIV/0!"}},{"$f":"'可視化結果（広域機関用）'!B9","v":{"$error":"#DIV/0!"}},{"$f":"'可視化結果（広域機関用）'!B10","v":{"$error":"#DIV/0!"}},{"$f":"'可視化結果（広域機関用）'!B11","v":{"$error":"#DIV/0!"}},{"$f":"'可視化結果（広域機関用）'!B12","v":{"$error":"#DIV/0!"}},{"$f":"'可視化結果（広域機関用）'!B13","v":{"$error":"#DIV/0!"}},{"$f":"'可視化結果（広域機関用）'!B14","v":{"$error":"#DIV/0!"}},{"$f":"'可視化結果（広域機関用）'!B15","v":{"$error":"#DIV/0!"}},{"$f":"'可視化結果（広域機関用）'!B16","v":{"$error":"#DIV/0!"}},{"$f":"'可視化結果（広域機関用）'!B17","v":{"$error":"#DIV/0!"}},{"$f":"VLOOKUP(U2,チェックシート!$D$7:$J$124,7,FALSE)","v":"未選択"},{"$f":"VLOOKUP(V2,チェックシート!$D$7:$J$124,7,FALSE)","v":"未選択"},{"$f":"VLOOKUP(W2,チェックシート!$D$7:$J$124,7,FALSE)","v":"未選択"},{"$f":"VLOOKUP(X2,チェックシート!$D$7:$J$124,7,FALSE)","v":"未選択"},{"$f":"VLOOKUP(Y2,チェックシート!$D$7:$J$124,7,FALSE)","v":"未選択"},{"$f":"VLOOKUP(Z2,チェックシート!$D$7:$J$124,7,FALSE)","v":"未選択"},{"$f":"VLOOKUP(AA2,チェックシート!$D$7:$J$124,7,FALSE)","v":"未選択"},{"$f":"VLOOKUP(AB2,チェックシート!$D$7:$J$124,7,FALSE)","v":"未選択"},{"$f":"VLOOKUP(AC2,チェックシート!$D$7:$J$124,7,FALSE)","v":"未選択"},{"$f":"VLOOKUP(AD2,チェックシート!$D$7:$J$124,7,FALSE)","v":"未選択"},{"$f":"VLOOKUP(AE2,チェックシート!$D$7:$J$124,7,FALSE)","v":"未選択"},{"$f":"VLOOKUP(AF2,チェックシート!$D$7:$J$124,7,FALSE)","v":"未選択"},{"$f":"VLOOKUP(AG2,チェックシート!$D$7:$J$124,7,FALSE)","v":"未選択"},{"$f":"VLOOKUP(AH2,チェックシート!$D$7:$J$124,7,FALSE)","v":"未選択"},{"$f":"VLOOKUP(AI2,チェックシート!$D$7:$J$124,7,FALSE)","v":"未選択"},{"$f":"VLOOKUP(AJ2,チェックシート!$D$7:$J$124,7,FALSE)","v":"未選択"},{"$f":"VLOOKUP(AK2,チェックシート!$D$7:$J$124,7,FALSE)","v":"未選択"},{"$f":"VLOOKUP(AL2,チェックシート!$D$7:$J$124,7,FALSE)","v":"未選択"},{"$f":"VLOOKUP(AM2,チェックシート!$D$7:$J$124,7,FALSE)","v":"未選択"},{"$f":"VLOOKUP(AN2,チェックシート!$D$7:$J$124,7,FALSE)","v":"未選択"},{"$f":"VLOOKUP(AO2,チェックシート!$D$7:$J$124,7,FALSE)","v":"未選択"},{"$f":"VLOOKUP(AP2,チェックシート!$D$7:$J$124,7,FALSE)","v":"未選択"},{"$f":"VLOOKUP(AQ2,チェックシート!$D$7:$J$124,7,FALSE)","v":"未選択"},{"$f":"VLOOKUP(AR2,チェックシート!$D$7:$J$124,7,FALSE)","v":"未選択"},{"$f":"VLOOKUP(AS2,チェックシート!$D$7:$J$124,7,FALSE)","v":"未選択"},{"$f":"VLOOKUP(AT2,チェックシート!$D$7:$J$124,7,FALSE)","v":"未選択"},{"$f":"VLOOKUP(AU2,チェックシート!$D$7:$J$124,7,FALSE)","v":"未選択"},{"$f":"VLOOKUP(AV2,チェックシート!$D$7:$J$124,7,FALSE)","v":"未選択"},{"$f":"VLOOKUP(AW2,チェックシート!$D$7:$J$124,7,FALSE)","v":"未選択"},{"$f":"VLOOKUP(AX2,チェックシート!$D$7:$J$124,7,FALSE)","v":"未選択"},{"$f":"VLOOKUP(AY2,チェックシート!$D$7:$J$124,7,FALSE)","v":"未選択"},{"$f":"VLOOKUP(AZ2,チェックシート!$D$7:$J$124,7,FALSE)","v":"未選択"},{"$f":"VLOOKUP(BA2,チェックシート!$D$7:$J$124,7,FALSE)","v":"未選択"},{"$f":"VLOOKUP(BB2,チェックシート!$D$7:$J$124,7,FALSE)","v":"未選択"},{"$f":"VLOOKUP(BC2,チェックシート!$D$7:$J$124,7,FALSE)","v":"未選択"},{"$f":"VLOOKUP(BD2,チェックシート!$D$7:$J$124,7,FALSE)","v":"未選択"},{"$f":"VLOOKUP(BE2,チェックシート!$D$7:$J$124,7,FALSE)","v":"未選択"},{"$f":"VLOOKUP(BF2,チェックシート!$D$7:$J$124,7,FALSE)","v":"未選択"},{"$f":"VLOOKUP(BG2,チェックシート!$D$7:$J$124,7,FALSE)","v":"未選択"},{"$f":"VLOOKUP(BH2,チェックシート!$D$7:$J$124,7,FALSE)","v":"未選択"},{"$f":"VLOOKUP(BI2,チェックシート!$D$7:$J$124,7,FALSE)","v":"未選択"},{"$f":"VLOOKUP(BJ2,チェックシート!$D$7:$J$124,7,FALSE)","v":"未選択"},{"$f":"VLOOKUP(BK2,チェックシート!$D$7:$J$124,7,FALSE)","v":"未選択"},{"$f":"VLOOKUP(BL2,チェックシート!$D$7:$J$124,7,FALSE)","v":"未選択"},{"$f":"VLOOKUP(BM2,チェックシート!$D$7:$J$124,7,FALSE)","v":"未選択"},{"$f":"VLOOKUP(BN2,チェックシート!$D$7:$J$124,7,FALSE)","v":"未選択"},{"$f":"VLOOKUP(BO2,チェックシート!$D$7:$J$124,7,FALSE)","v":"未選択"},{"$f":"VLOOKUP(BP2,チェックシート!$D$7:$J$124,7,FALSE)","v":"未選択"},{"$f":"VLOOKUP(BQ2,チェックシート!$D$7:$J$124,7,FALSE)","v":"未選択"},{"$f":"VLOOKUP(BR2,チェックシート!$D$7:$J$124,7,FALSE)","v":"未選択"},{"$f":"VLOOKUP(BS2,チェックシート!$D$7:$J$124,7,FALSE)","v":"未選択"},{"$f":"VLOOKUP(BT2,チェックシート!$D$7:$J$124,7,FALSE)","v":"未選択"},{"$f":"VLOOKUP(BU2,チェックシート!$D$7:$J$124,7,FALSE)","v":"未選択"},{"$f":"VLOOKUP(BV2,チェックシート!$D$7:$J$124,7,FALSE)","v":"未選択"},{"$f":"VLOOKUP(BW2,チェックシート!$D$7:$J$124,7,FALSE)","v":"未選択"},{"$f":"VLOOKUP(BX2,チェックシート!$D$7:$J$124,7,FALSE)","v":"未選択"},{"$f":"VLOOKUP(BY2,チェックシート!$D$7:$J$124,7,FALSE)","v":"未選択"},{"$f":"VLOOKUP(BZ2,チェックシート!$D$7:$J$124,7,FALSE)","v":"未選択"},{"$f":"VLOOKUP(CA2,チェックシート!$D$7:$J$124,7,FALSE)","v":"未選択"},{"$f":"VLOOKUP(CB2,チェックシート!$D$7:$J$124,7,FALSE)","v":"未選択"},{"$f":"VLOOKUP(CC2,チェックシート!$D$7:$J$124,7,FALSE)","v":"未選択"},{"$f":"VLOOKUP(CD2,チェックシート!$D$7:$J$124,7,FALSE)","v":"未選択"},{"$f":"VLOOKUP(CE2,チェックシート!$D$7:$J$124,7,FALSE)","v":"未選択"},{"$f":"VLOOKUP(CF2,チェックシート!$D$7:$J$124,7,FALSE)","v":"未選択"},{"$f":"VLOOKUP(CG2,チェックシート!$D$7:$J$124,7,FALSE)","v":"未選択"},{"$f":"VLOOKUP(CH2,チェックシート!$D$7:$J$124,7,FALSE)","v":"未選択"},{"$f":"VLOOKUP(CI2,チェックシート!$D$7:$J$124,7,FALSE)","v":"未選択"},{"$f":"VLOOKUP(CJ2,チェックシート!$D$7:$J$124,7,FALSE)","v":"未選択"}]
[]
["ツールで集計する際、回答を読み込みしやすくするため、回答を一行にまとめたシート"]

{"sheet":"フィルター個数確認","index":5,"n_rows":24,"n_cols":2,"rows_kept":24,"cut":false,"hidden":true,"merged":[]}
["カテゴリー","フィルター個数"]
["資産管理（ID.AM）",{"$f":"SUBTOTAL(3,チェックシート!J8:J13)","v":6}]
["ビジネス環境（ID.BE）",{"$f":"SUBTOTAL(3,チェックシート!J14:J18)","v":5}]
["ガバナンス（ID.GV）",{"$f":"SUBTOTAL(3,チェックシート!J19:J22)","v":4}]
["リスクアセスメント（ID.RA）",{"$f":"SUBTOTAL(3,チェックシート!J23:J28)","v":6}]
["リスク管理戦略（ID.RM）",{"$f":"SUBTOTAL(3,チェックシート!J29:J31)","v":3}]
["サプライチェーンリスクマネジメント（ID.SC）",{"$f":"SUBTOTAL(3,チェックシート!J32:J36)","v":5}]
["アクセス制御（PR.AC）",{"$f":"SUBTOTAL(3,チェックシート!J37:J43)","v":7}]
["意識向上及びトレーニング（PR.AT）",{"$f":"SUBTOTAL(3,チェックシート!J44:J48)","v":5}]
["データセキュリティ（PR.DS）",{"$f":"SUBTOTAL(3,チェックシート!J49:J56)","v":8}]
["情報を保護するためのプロセス及び手順（PR.IP）",{"$f":"SUBTOTAL(3,チェックシート!J57:J68)","v":12}]
["保守（PR.MA）",{"$f":"SUBTOTAL(3,チェックシート!J69:J70)","v":2}]
["保護技術（PR.PT）",{"$f":"SUBTOTAL(3,チェックシート!J71:J75)","v":5}]
["異常とイベント（DE.AE）",{"$f":"SUBTOTAL(3,チェックシート!J76:J80)","v":5}]
["セキュリティの継続的なモニタリング（DE.CM）",{"$f":"SUBTOTAL(3,チェックシート!J81:J88)","v":8}]
{"$rows_left_out":10}
{"sheet":"事業者とガイドラインの対応関係","index":6,"n_rows":8,"n_cols":10,"rows_kept":8,"cut":false,"hidden":true,"merged":[]}
[null,"電力制御システム\nセキュリティガイドライン\n（JEAG1111-2019）","ERABに関する\nサイバーセキュリティ\nガイドライン Ver 2.0","小売電気事業者のための\nサイバーセキュリティ対策\nガイドライン Ver 1.0","系統連系技術要件\n【託送供給等約款別冊】","自家用電気工作物に係るサイバーセキュリティの確保に関するガイドライン（内規）","特定卸供給事業に係るサイバーセキュリティ確保の指針","サイバーセキュリティ\n経営ガイドライン Ver 2.0","広域提出用"]
["発電事業者","〇",null,null,null,null,null,null,null,"※現在のスコアは、「電力制御システムセキュリティガイドライン（JEAG1111-2019）」の項目と対応付け可能なリスク点検項目に基づき評価している。"]
["小売電気事業者",null,null,"〇",null,null,null,"〇",null,"※現在のスコアは、「小売電気事業者のためのサイバーセキュリティ対策ガイドライン Ver. 1.0」の項目と対応付け可能なリスク点検項目に基づき評価している。"]
["自家用電気工作物設置者",null,null,null,"〇","〇",null,null,null,"※現在のスコアは、「自家用電気工作物に係るサイバーセキュリティの確保に関するガイドライン（内規）」の項目と対応付け可能なリスク点検項目に基づき評価している。"]
["アグリゲーター",null,"〇",null,null,null,"〇",null,null,"※現在のスコアは、「ERABに関するサイバーセキュリティガイドライン Ver 2.0」、「特定卸供給事業に係るサイバーセキュリティの確保の指針」の項目と対応付け可能なリスク点検項目に基づき評価している。"]
["その他",null,null,null,null,null,null,"〇",null,"※現在のスコアは、「サイバーセキュリティ経営ガイドライン Ver 2.0」の要求事項と対応付けされる項目で評価している"]
["広域機関提出用",null,null,null,null,null,null,null,"〇","※現在のスコアは、広域機関に提出するリスク点検項目に基づき評価している。"]
["全て表示","〇","〇","〇","〇","〇","〇","〇","〇"]

{"sheet":"選択肢","index":7,"n_rows":6,"n_cols":2,"rows_kept":6,"cut":false,"hidden":true,"merged":[]}
["発電事業者","未選択"]
["小売電気事業者",0]
["自家用電気工作物設置者",1]
["アグリゲーター",2]
["広域機関提出用",3]
["全て表示",4]